p_i,A,R,N,D,C,Q,E,G,H,I,L,K,M,F,P,S,T,W,Y,V,*
1,,,,,,,,,,,,,,,0.000,,,,,,
2,,,,,,0.000,,,,,,,,,,,,,,,
3,,,,,,,,,,0.000,,,,,,,,,,,
4,,,,,,,,,,,,,,,,,0.000,,,,
5,,,,,,,,,,,0.000,,,,,,,,,,
6,,,,,,,,,,,,,,,,,,0.000,,,
7,,,,,,0.000,,,,,,,,,,,,,,,
8,,0.000,,,,,,,,,,,,,,,,,,,
9,,,,,,,,,,,,,,,0.000,,,,,,
10,,,,,,,,,,2.053,-5.317,,,1.017,,,,,,0.000,
11,,,,,,,,,,1.769,,,,,,,,,,-1.769,
12,,,,,,,,,,,,,,,,,0.000,,,,
13,,,,,,,,,,-0.279,,,,,,,,,,0.279,
14,,,,,,,,,,,,0.000,,,,,,,,,
15,,,,,,,,,,0.000,,,,,,,,,,,
16,,,,,,,0.000,0.000,,,,,,,,,,,,,
17,,,,,,,,0.000,,,,,,,,,,,,,
18,,,,,,0.000,,,,,,,,,,,,,,,
19,,,,,,,,,,,0.000,,,,,,,,,,
20,,0.000,,,,,,,,0.000,,0.000,,,,,0.000,,,,
21,,,,,,,0.000,,,,,,,,,,,,,,
22,0.000,,,,,,,,,,,,,,,,,,,,
23,,,,,,,,,,,0.000,,,,,,,,,,
24,,,,,,,,,,3.002,-3.002,,,,,,,,,,
25,,,,0.000,,,,,,,,,,,,,,,,,
26,,,,,,,,,,,,,,,,,0.000,,,,
27,,,,,,,,0.000,,,,,,,,,,,,,
28,0.000,,,,,,,,,,,,,,,,,,,,
29,,,,0.000,,,,,,,,,,,,,,,,,
30,,,0.000,0.000,,,,,,,,,,,,,,,,,
31,,,,,,,,,,,,,,,,,0.000,,,,
32,,,,,,,,,,3.802,,,,,,,,,,-3.802,
33,,,,,,,,,,,-3.644,,,3.644,,,,,,,
34,,,,,,0.000,0.000,,,,,,,,,,,,,,
35,,,,,,,0.000,0.000,,,,,,,,,,,,,
36,,,,,,,,,,0.000,0.000,,0.000,,,,,,,,
37,,,0.000,,,,,,,,,,,,,,,,,,
38,,,,,,,,,,,0.000,,,,,,,,,,
39,,,,,,,,,,,,,,,0.000,,,,,,
40,,,,,,,,0.000,,,,,,,,,,,,,
41,,0.000,,,,,,,,,,,,,,,,,,,
42,,,,,,,,,,,,,,,,,,0.000,,,
43,,,,,,,,,,,,-1.965,,,,,1.965,,,,
44,,,,,,,,,,,,,,,0.000,,,,,,
45,,,,,,,,,,,,0.000,,,,,,,,,
46,,,,,,,,,,1.294,2.005,,-3.867,,,,,,,,
47,0.000,,,,,,,,,0.000,,,,,,,,,,0.000,
48,,,,,,,,-0.520,,,,,,,,,,,,0.520,
49,,,,,,,,0.000,,,,,,,,,,,,,
50,,,,,,,,,,0.000,,,,,,,,,,0.000,
51,,,,,,,,0.000,,,,,,,,,,,,,
52,,,,,,,,0.000,,,,,,,,,,,,,
53,,,,,,,,,,,0.000,,,0.000,,,,,,,
54,0.000,,,,,,,,,-5.864,2.495,,0.320,,,,,,,0.732,
55,,,,,,,,,,,,0.000,,,,,,,,,
56,,,,,,,,,,,,,,,,,,,,0.000,
57,,0.000,,,,,,,,,,,,,,,,,,,
58,,,,,,-0.976,0.976,,,,,,,,,,,,,,
59,,,,,,,,,,,,,,,,,,,0.000,,
60,,,,0.000,,,0.000,,,,,,,,,,,,,,
61,,,,,,0.000,,,,,,,,,,,,,,,
62,,,,,,,,,,-0.212,,,,,,,,,,0.212,
63,,,,,,,,,,,-1.211,,,,1.211,,,,,,
64,,,,,,,,,,0.000,0.000,,0.000,,,,,,,0.000,
65,,,,,,,0.000,,,,,,,,,,,,,,
66,,,,,,,,,,0.000,,,,,,,,,,,
67,,,,,0.000,,,,,,,,,,,,,,,,
68,,,,,,,,0.000,,,,,,,,,,,,,
69,,,,,,,,,0.000,,,0.000,,,,,,,,,
70,,,,,,,,,,,,0.000,,,,,,,,,
71,-3.949,,,,,,,,,0.000,,,,,,,0.000,,,4.539,
72,,,,,,,,,,0.000,,,,,,,,,,,
73,,,,,0.000,,,-2.275,,,,,,,,0.461,0.000,,,,
74,,,,,,,,,,,,,,,0.000,,0.000,,,,
75,,,,,,,,,,,,,,,,,,,,0.000,
76,,,,,,,,,,,0.000,,,,,,,,,0.000,
77,,,,,,,,,,0.000,,,,,,,,,,0.000,
78,,,,,,,,0.000,,,,,,,,,,,,,
79,,,,,,,,,,,,,,,0.000,,,,,,
80,,,,,,,,,,,,,,,,,0.000,,,,
81,,,,,,,,,,,,,,,0.000,,,,,,
82,0.717,,,,,,,,,0.000,,,,,,0.000,0.749,,,-3.347,
83,,,-0.201,0.201,,,,,,,,,,,,,,,,,
84,,,,,,,,,,-5.557,,,,,,,,,,5.557,
85,,,,,,,,,,0.000,,,,,,,,,,0.000,
86,,,,,,,,0.000,,,,,,,,,,,,,
87,,0.000,,,,,,,,,,,,,,,,,,,
88,,,0.000,0.000,,,,,,,,,,,,,,,,,
89,,,,,,,,,,,0.000,,,,,,,,,0.000,
90,,,,,,,,,,,-2.996,,2.996,,,,,,,,
91,,,,,,,,,,,,,,,,,0.000,,,,
92,,,,,,0.000,,,,,,,,,,,,,,,
93,,,,,,,,,,0.000,0.000,,,,,,,,,,
94,,,,,,,,0.000,,,,,,,,,,,,,
95,,,,,0.000,,,,,,,,,,,,,,,,
96,,,,,,,,,,,,,,,,,0.000,,,,
97,,,,,,,,,,,0.000,,,,,,,,,,
98,,,0.000,,,,,,,,,,,,,,,,,,
99,,,,,,,,,,,,,,0.000,,,,,,,
